{"text_format":"1","workbook":"xlsx","n_sheets":27,"sheets":["DATA","LIST","0","1","2","3","4","5","6","7","8","9","ППГ","Безопасность","Конструкция","Паруса","Управление","ППВВП","Навигация","Узлы","Теория","Метео","Сигналы","Цифры","Правила","Право дороги","Практика"],"not_rendered":{"charts":0,"images":33,"macros":1,"external_links":0,"defined_names":1,"comments":1,"pivot_tables":0},"unopened":[],"bounds":{"document_bytes":16777216,"sheet_cells":100000,"rows_first":2000,"rows_last":500,"rows_between":2000,"halvings":0,"cell_chars":16384,"cell_head_chars":4096},"cells_cut":0,"cells_raw":0,"read":"whole","date_system":"1900"}

{"sheet":"DATA","index":0,"n_rows":13339,"n_cols":19,"rows_kept":13339,"cut":false,"hidden":false,"merged":[]}
[]
[]
[]
[]
[]
[]
{"$rows_left_out":13334}
{"sheet":"LIST","index":1,"n_rows":69,"n_cols":9,"rows_kept":69,"cut":false,"hidden":false,"merged":[[44,1,44,4],[29,0,29,1],[31,5,31,8],[0,7,0,8],[37,1,37,4],[38,3,38,7]]}
[null,{"$f":"\" ЭКЗАМЕНАЦИОННЫЙ ЛИСТ №  \"&VLOOKUP($A$7,DATA!$A$10:$S$100294,1,TRUE)&\"/\"&VLOOKUP($A$7,DATA!$A$10:$S$100294,3,TRUE)","v":" ЭКЗАМЕНАЦИОННЫЙ ЛИСТ №  15077/"},null,"                                           ЭКЗАМЕНАЦИОННАЯ ВЕДОМОСТЬ",12393,null,12402,{"$f":"VLOOKUP($A$7,DATA!$A$10:$S$100294,10,TRUE)","v":"2025-03-05"}]
[null,"     ",null,"                          Результаты квалификационных испытаний "]
[null,{"$f":"\" Имя    \"&VLOOKUP($A$7,DATA!$A$10:$S$100294,4,TRUE)","v":" Имя    Черкасский Артём"},null,"                                     по теоретической подготовке ",null,null,"Билет №",{"$f":"RIGHT(A7)","v":"7"}]
["Место",null,12393,null,"Наименование дисциплины ","часов","Оценка ","Дата ","фамилия "]
["для ",{"$f":"\" Отчество                \"&VLOOKUP($A$7,DATA!$A$10:$S$100294,5,TRUE)","v":" Отчество                Дмитриевич"},null,"№ ",null,null,null,null,"экзаменатора"]
["фото","    ",null,"  1.","Теория и устройство парусной яхты.",8,"хор",{"$f":"VLOOKUP($A$7,DATA!$A$10:$S$100294,10,TRUE)","v":"2025-03-05"}]
{"$rows_left_out":64}
{"sheet":"0","index":2,"n_rows":34,"n_cols":8,"rows_kept":34,"cut":false,"hidden":false,"merged":[[28,3,28,7],[32,3,32,7],[33,3,33,7],[18,3,18,7],[20,3,20,7],[21,3,21,7],[22,3,22,7],[24,3,24,5],[27,3,27,7],[17,3,17,7],[1,1,1,4],[2,3,2,7],[7,3,7,7],[10,3,10,7],[13,3,13,7]]}
[null,"Экзаменационные вопросы  - РУЛЕВОЙ  ПАРУСНОЙ ЯХТЫ Базовый курс",null,null,{"$f":"LIST!H1:I1","v":"2025-03-05"},0]
[null,"КВАЛИФИКАЦИОННЫЕ ТРЕБОВАНИЯ ПОДГОТОВКИ РУЛЕВЫХ И КАПИТАНОВ ПАРУСНЫХ ЯХТ"]
[null,"Экзаменатор  - Маслов А.О.",null,{"$f":"\"Испытуемый  \"&LIST!B3","v":"Испытуемый   Имя    Черкасский Артём"}]
[null,"Билет  ",null,"РУЛЕВОЙ ПАРУСНОЙ ЯХТЫ",{"$f":"LIST!H3","v":"7"}]
[null,"Дисциплина",null,"Правила парусных Гонок"]
[]
{"$rows_left_out":29}
{"sheet":"1","index":3,"n_rows":34,"n_cols":8,"rows_kept":34,"cut":false,"hidden":false,"merged":[[24,3,24,5],[27,3,27,7],[28,3,28,7],[32,3,32,7],[33,3,33,7],[7,3,7,7],[10,3,10,7],[2,3,2,7],[17,3,17,7],[1,1,1,4],[20,3,20,7],[18,3,18,7],[21,3,21,7],[22,3,22,7],[13,3,13,7]]}
[null,"Экзаменационные вопросы  - РУЛЕВОЙ  ПАРУСНОЙ ЯХТЫ Базовый курс",null,null,{"$f":"LIST!H1:I1","v":"2025-03-05"},0]
[null,"КВАЛИФИКАЦИОННЫЕ ТРЕБОВАНИЯ ПОДГОТОВКИ РУЛЕВЫХ И КАПИТАНОВ ПАРУСНЫХ ЯХТ"]
[null,"Экзаменатор  - Маслов А.О.",null,{"$f":"\"Испытуемый  \"&LIST!B3","v":"Испытуемый   Имя    Черкасский Артём"}]
[null,"Билет  ",null,"РУЛЕВОЙ ПАРУСНОЙ ЯХТЫ",{"$f":"LIST!H3","v":"7"}]
[null,"Дисциплина",null,"Правила парусных Гонок"]
[]
{"$rows_left_out":29}
{"sheet":"2","index":4,"n_rows":35,"n_cols":8,"rows_kept":35,"cut":false,"hidden":false,"merged":[[1,1,1,4],[2,3,2,7],[18,3,18,7],[33,3,33,7],[6,3,6,7],[9,3,9,7],[12,3,12,7],[15,3,15,7],[34,3,34,7],[19,3,19,7],[21,3,21,7],[22,3,22,7],[23,3,23,7],[25,3,25,5],[28,3,28,7],[26,3,26,5],[29,3,29,7]]}
[null,"Экзаменационные вопросы  - РУЛЕВОЙ  ПАРУСНОЙ ЯХТЫ Базовый курс",null,null,{"$f":"LIST!H1:I1","v":"2025-03-05"},0]
[null,"КВАЛИФИКАЦИОННЫЕ ТРЕБОВАНИЯ ПОДГОТОВКИ РУЛЕВЫХ И КАПИТАНОВ ПАРУСНЫХ ЯХТ"]
[null,"Экзаменатор  - Маслов А.О.",null,{"$f":"\"Испытуемый  \"&LIST!B3","v":"Испытуемый   Имя    Черкасский Артём"}]
[null,"Билет  ",null,"РУЛЕВОЙ ПАРУСНОЙ ЯХТЫ",{"$f":"LIST!H3","v":"7"}]
[null,"Дисциплина",null,"Правила парусных Гонок"]
[]
{"$rows_left_out":30}
{"sheet":"3","index":5,"n_rows":34,"n_cols":8,"rows_kept":34,"cut":false,"hidden":false,"merged":[[28,3,28,7],[32,3,32,7],[33,3,33,7],[18,3,18,7],[20,3,20,7],[21,3,21,7],[22,3,22,7],[24,3,24,5],[27,3,27,7],[17,3,17,7],[1,1,1,4],[2,3,2,7],[7,3,7,7],[10,3,10,7],[13,3,13,7]]}
[null,"Экзаменационные вопросы  - РУЛЕВОЙ  ПАРУСНОЙ ЯХТЫ Базовый курс",null,null,{"$f":"LIST!H1:I1","v":"2025-03-05"},0]
[null,"КВАЛИФИКАЦИОННЫЕ ТРЕБОВАНИЯ ПОДГОТОВКИ РУЛЕВЫХ И КАПИТАНОВ ПАРУСНЫХ ЯХТ"]
[null,"Экзаменатор  - Маслов А.О.",null,{"$f":"\"Испытуемый  \"&LIST!B3","v":"Испытуемый   Имя    Черкасский Артём"}]
[null,"Билет  ",null,"РУЛЕВОЙ ПАРУСНОЙ ЯХТЫ",{"$f":"LIST!H3","v":"7"}]
[null,"Дисциплина",null,"Правила парусных Гонок"]
[]
{"$rows_left_out":29}
{"sheet":"4","index":6,"n_rows":38,"n_cols":8,"rows_kept":38,"cut":false,"hidden":false,"merged":[[36,3,36,7],[37,3,37,7],[22,3,22,7],[24,3,24,7],[25,3,25,7],[26,3,26,7],[28,3,28,5],[31,3,31,7],[1,1,1,4],[2,3,2,7],[21,3,21,7],[6,0,6,2],[32,3,32,7]]}
[null,"Экзаменационные вопросы  - РУЛЕВОЙ  ПАРУСНОЙ ЯХТЫ Базовый курс",null,null,{"$f":"LIST!H1:I1","v":"2025-03-05"},0]
[null,"КВАЛИФИКАЦИОННЫЕ ТРЕБОВАНИЯ ПОДГОТОВКИ РУЛЕВЫХ И КАПИТАНОВ ПАРУСНЫХ ЯХТ"]
[null,"Экзаменатор  - Маслов А.О.",null,{"$f":"\"Испытуемый  \"&LIST!B3","v":"Испытуемый   Имя    Черкасский Артём"}]
[null,"Билет  ",null,"РУЛЕВОЙ ПАРУСНОЙ ЯХТЫ",{"$f":"LIST!H3","v":"7"}]
[null,"Дисциплина",null,"Правила парусных Гонок"]
[]
{"$rows_left_out":33}
{"sheet":"5","index":7,"n_rows":36,"n_cols":8,"rows_kept":36,"cut":false,"hidden":false,"merged":[[35,3,35,7],[9,3,9,7],[20,3,20,7],[22,3,22,7],[23,3,23,7],[24,3,24,7],[26,3,26,5],[29,3,29,7],[1,1,1,4],[2,3,2,7],[19,3,19,7],[30,3,30,7],[34,3,34,7]]}
[null,"Экзаменационные вопросы  - РУЛЕВОЙ  ПАРУСНОЙ ЯХТЫ Базовый курс",null,null,{"$f":"LIST!H1:I1","v":"2025-03-05"},0]
[null,"КВАЛИФИКАЦИОННЫЕ ТРЕБОВАНИЯ ПОДГОТОВКИ РУЛЕВЫХ И КАПИТАНОВ ПАРУСНЫХ ЯХТ"]
[null,"Экзаменатор  - Маслов А.О.",null,{"$f":"\"Испытуемый  \"&LIST!B3","v":"Испытуемый   Имя    Черкасский Артём"}]
[null,"Билет  ",null,"РУЛЕВОЙ ПАРУСНОЙ ЯХТЫ",{"$f":"LIST!H3","v":"7"}]
[null,"Дисциплина",null,"Правила парусных Гонок"]
[]
{"$rows_left_out":31}
{"sheet":"6","index":8,"n_rows":36,"n_cols":8,"rows_kept":36,"cut":false,"hidden":false,"merged":[[35,3,35,7],[23,3,23,7],[24,3,24,7],[26,3,26,5],[29,3,29,7],[30,3,30,7],[34,3,34,7],[22,3,22,7],[1,1,1,4],[2,3,2,7],[9,3,9,7],[19,3,19,7],[20,3,20,7]]}
[null,"Экзаменационные вопросы  - РУЛЕВОЙ  ПАРУСНОЙ ЯХТЫ Базовый курс",null,null,{"$f":"LIST!H1:I1","v":"2025-03-05"},0]
[null,"КВАЛИФИКАЦИОННЫЕ ТРЕБОВАНИЯ ПОДГОТОВКИ РУЛЕВЫХ И КАПИТАНОВ ПАРУСНЫХ ЯХТ"]
[null,"Экзаменатор  - Маслов А.О.",null,{"$f":"\"Испытуемый  \"&LIST!B3","v":"Испытуемый   Имя    Черкасский Артём"}]
[null,"Билет  ",null,"РУЛЕВОЙ ПАРУСНОЙ ЯХТЫ",{"$f":"LIST!H3","v":"7"}]
[null,"Дисциплина",null,"Правила парусных Гонок"]
[]
{"$rows_left_out":31}
{"sheet":"7","index":9,"n_rows":38,"n_cols":8,"rows_kept":38,"cut":false,"hidden":false,"merged":[[37,3,37,7],[25,3,25,7],[26,3,26,7],[28,3,28,5],[31,3,31,7],[32,3,32,7],[36,3,36,7],[24,3,24,7],[1,1,1,4],[2,3,2,7],[6,0,6,2],[21,3,21,7],[22,3,22,7]]}
[null,"Экзаменационные вопросы  - РУЛЕВОЙ  ПАРУСНОЙ ЯХТЫ Базовый курс",null,null,{"$f":"LIST!H1:I1","v":"2025-03-05"},0]
[null,"КВАЛИФИКАЦИОННЫЕ ТРЕБОВАНИЯ ПОДГОТОВКИ РУЛЕВЫХ И КАПИТАНОВ ПАРУСНЫХ ЯХТ"]
[null,"Экзаменатор  - Маслов А.О.",null,{"$f":"\"Испытуемый  \"&LIST!B3","v":"Испытуемый   Имя    Черкасский Артём"}]
[null,"Билет  ",null,"РУЛЕВОЙ ПАРУСНОЙ ЯХТЫ",{"$f":"LIST!H3","v":"7"}]
[null,"Дисциплина",null,"Правила парусных Гонок"]
[]
{"$rows_left_out":33}
{"sheet":"8","index":10,"n_rows":35,"n_cols":8,"rows_kept":35,"cut":false,"hidden":false,"merged":[[26,3,26,5],[28,3,28,7],[29,3,29,7],[33,3,33,7],[34,3,34,7],[25,3,25,5],[1,1,1,4],[2,3,2,7],[6,3,6,7],[9,3,9,7],[12,3,12,7],[15,3,15,7],[18,3,18,7],[19,3,19,7],[21,3,21,7],[22,3,22,7],[23,3,23,7]]}
[null,"Экзаменационные вопросы  - РУЛЕВОЙ  ПАРУСНОЙ ЯХТЫ Базовый курс",null,null,{"$f":"LIST!H1:I1","v":"2025-03-05"},0]
[null,"КВАЛИФИКАЦИОННЫЕ ТРЕБОВАНИЯ ПОДГОТОВКИ РУЛЕВЫХ И КАПИТАНОВ ПАРУСНЫХ ЯХТ"]
[null,"Экзаменатор  - Маслов А.О.",null,{"$f":"\"Испытуемый  \"&LIST!B3","v":"Испытуемый   Имя    Черкасский Артём"}]
[null,"Билет  ",null,"РУЛЕВОЙ ПАРУСНОЙ ЯХТЫ",{"$f":"LIST!H3","v":"7"}]
[null,"Дисциплина",null,"Правила парусных Гонок"]
[]
{"$rows_left_out":30}
{"sheet":"9","index":11,"n_rows":36,"n_cols":8,"rows_kept":36,"cut":false,"hidden":false,"merged":[[35,3,35,7],[23,3,23,7],[24,3,24,7],[26,3,26,5],[29,3,29,7],[30,3,30,7],[34,3,34,7],[22,3,22,7],[1,1,1,4],[2,3,2,7],[9,3,9,7],[19,3,19,7],[20,3,20,7]]}
[null,"Экзаменационные вопросы  - РУЛЕВОЙ  ПАРУСНОЙ ЯХТЫ Базовый курс",null,null,{"$f":"LIST!H1:I1","v":"2025-03-05"},0]
[null,"КВАЛИФИКАЦИОННЫЕ ТРЕБОВАНИЯ ПОДГОТОВКИ РУЛЕВЫХ И КАПИТАНОВ ПАРУСНЫХ ЯХТ"]
[null,"Экзаменатор  - Маслов А.О.",null,{"$f":"\"Испытуемый  \"&LIST!B3","v":"Испытуемый   Имя    Черкасский Артём"}]
[null,"Билет  ",null,"РУЛЕВОЙ ПАРУСНОЙ ЯХТЫ",{"$f":"LIST!H3","v":"7"}]
[null,"Дисциплина",null,"Правила парусных Гонок"]
[]
{"$rows_left_out":31}
{"sheet":"ППГ","index":12,"n_rows":329,"n_cols":3,"rows_kept":329,"cut":false,"hidden":false,"merged":[]}
[1,"Могут ли быть изменены ППГ ранее 01.01.2017 года?","Введение. ( Пересмотр правил)"]
[2,"Имеют ли случаи ИСАФ статус правил? ","Введение. (Случаи и Решения). Определение «Правило»"]
[3,"Можно ли при рассмотрении протеста ссылаться на Случаи ИСАФ, как на авторитетную трактовку применяемого правила? ","Введение (Случаи и Решения). Определение «Правило»"]
[4,"Обозначает ли термин «судно» так же и парусную яхту?","Введение. (Терминология)"]
[5,"Может ли Гон-й Комитет состоять из одного человека?","Введение. (Терминология)"]
[6,"Если правила приложений ППГ противоречат правилам Части 2, то правила приложений имеют преимущество?","Введение. (Приложения)"]
{"$rows_left_out":324}
{"sheet":"Безопасность","index":13,"n_rows":68,"n_cols":8,"rows_kept":68,"cut":false,"hidden":false,"merged":[]}
[1,"Факторы, влияющие на безопасность яхты в море.",null,null,1,null,1,"1.1 Помощь находящимся в опасности "]
[2,"Источники прогноза погоды.\n Признаки подхода шквала.",null,null,2,null,2,"1.2 Спасательные принадлежности и индивидуальные средства обеспечения плавучести "]
[3,"Источники прогноза погоды. Действия при ухудшении погодных условий.",null,null,3,null,3,"2 ЧЕСТНАЯ СПОРТИВНАЯ БОРЬБА "]
[4,"Порядок проверки оборудования и снабжения яхты перед выходом в море.",null,null,4,null,4,"РЕШЕНИЕ УЧАСТВОВАТЬ В ГОНКЕ"]
[5,"Инструктаж экипажа перед выходом в море.",null,null,5,null,5,"5.Антидопинг"]
[6,"Спасательное оборудование яхты.",null,null,6,null,6,"40.Индивидуальные средства обеспечения плавучести"]
{"$rows_left_out":63}
{"sheet":"Конструкция","index":14,"n_rows":49,"n_cols":2,"rows_kept":49,"cut":false,"hidden":false,"merged":[]}
[1,"Типы  рулей."]
[2,"Типы якорей"]
[3,"Определение размеров и длины якорных канатов и цепей. "]
[4,"Основные размерения парусной язты"]
[5,"- осадка, высота надводного борта,"]
[6,"Подпалубное пространство: трюм, слани, каюта, форпик, ахтерпик."]
{"$rows_left_out":44}
{"sheet":"Паруса","index":15,"n_rows":30,"n_cols":2,"rows_kept":30,"cut":false,"hidden":false,"merged":[]}
[1,"Паруса, Основные, Дополнительные, Штормовые."]
[2,"Рифы"]
[3,"Части мачт: топ, шпор,"]
[4,"Устройства для применения и проводки такелажа:( дельные вещи)"]
[5,"Устройства для крепления парусов к рангоуту: ликпазы, рельсы "]
[6,"Стоячий такелаж"]
{"$rows_left_out":25}
{"sheet":"Управление","index":16,"n_rows":60,"n_cols":5,"rows_kept":60,"cut":false,"hidden":false,"merged":[]}
[1,"Буксировка",null,1,"1.Что такое курс? Какие бывают курсы яхт?"]
[2,"Взятие и отдача рифов. ",null,2,"2.Что такое галс? Какие бывают галсы?"]
[3,"Влияние других яхт на скорость яхты на лавировке. Термины впереди, на ветру, под ветром, позади.",null,3,"3.Какие курсы называются «Полные курсы», а какие «Острые курсы»?"]
[4,"Выполнение поворотов при сильном волнении. ",null,4,"4.Что такое поворот?"]
[5,"Курсовый угол. Уваливание, приведение к ветру. Перемена галса. Поворот оверштаг, фордевинд.",null,5,"5.Что такое поворот оверштаг?"]
[6,"Курсы яхты: компасный курс, курс относительно ветра. ",null,6,"6.Что такое поворот фордевинд?"]
{"$rows_left_out":55}
{"sheet":"ППВВП","index":17,"n_rows":23,"n_cols":3,"rows_kept":23,"cut":false,"hidden":false,"merged":[]}
[1,"Правила Плавания по Внутренним водным путям. \nКак обозначается судовой ход на внутренних водных путях РФ на реках? ","1.      Каким устройством измеряется скорость яхты и в каких единицах    измерения."]
[2,"Правила Плавания по Внутренним водным путям. \nТипы створных знаков","2.       Каким образом  на карте нанесена «широтная» сетка, и где на карте расположена её шкала?"]
[3,"Правила Плавания по Внутренним водным путям. Типы створных знаков","3.      Как учитывается восточное магнитное склонение при исчислении истинного курса от компасного."]
[4,"Правила Плавания по Внутренним водным путям.\nЗвуковые и Световые Сигналы, подаваемые судами с механическим двигателем.","4.      Что такое годовое изменение (прецессия) магнитного склонения."]
[5,"Правила Плавания по Внутренним водным путям.\nЗнак запрещения якорной стоянки на внутренних водных путях РФ.","5.      Как определить место судна на  море (на морской карте) используя береговые ориентиры: маяки, возвышенности, отдельные здания, мысы береговой (островной) линии."]
[6,"Правила Плавания по Внутренним водным путям.\nКак должен производиться обгон маломерным судном другого маломерного судна?","6.      Как предварительно вычислить время прохождения маршрута."]
{"$rows_left_out":18}
{"sheet":"Навигация","index":18,"n_rows":53,"n_cols":15,"rows_kept":53,"cut":false,"hidden":false,"merged":[]}
[1,"Основы морского права.\nОпределение - Открытое Море\nОпределение - Запретная зона"]
[2,"Выбор убежища в критических условиях"]
[3,"Геннакер ушел под воду и намотался на перо руля, ваши действия?"]
[4,"Лоция местного бассейна.  \nКак обозначается судовой ход на внутренних водных путях РФ на реках?"]
[5,"Осмотр и проверка мотора перед запуском"]
[6,"Осмотр и проверка яхты перед выходом"]
{"$rows_left_out":48}
{"sheet":"Узлы","index":19,"n_rows":20,"n_cols":6,"rows_kept":20,"cut":false,"hidden":false,"merged":[]}
[1,"прямой, восьмерка",null,1,"Бухта","Бухта - упаковка нового троса в форме полого цилиндра; трос или снасть, свернутая кругами, восьмеркой или свободными шлагами."]
[2,"Выбленочный",null,2,"Ворса ","Ворса - куски старых расплетенных пеньковых или любых других растительных тросов."]
[3,"простой",null,3,"Вырубить ","Вырубить - отрезать от бухты кусок троса."]
[4,"Беседочный ( булинь)",null,4,"Калышка ","Калышка - случайный, вредный завиток на тросе или снасти, возникающий от перекручивания."]
[5,"Буксирный",null,5,"Колышка ","Колышка - петля на тросе, являющаяся частью узла."]
[6,"Стопорный",null,6,"Конец ","Конец - кусок троса, вырубленный из бухты."]
{"$rows_left_out":15}
{"sheet":"Теория","index":20,"n_rows":41,"n_cols":5,"rows_kept":41,"cut":false,"hidden":false,"merged":[]}
[1,"Главные размерения яхты. Схема главных размерений"]
[2,"остойчивость (поперечная и продольная) швертботов Схема"]
[3,"остойчивость (поперечная и продольная) килевых яхт. Схема "]
[4,"Истинный и Вымпельный Ветер. "]
[5,"Диаграмма остойчивости. Причина опрокидывания яхт на разных курсах. "]
[6,"Устойчивость на курсе, поворотливость, маневренность (управляемость)."]
{"$rows_left_out":36}
{"sheet":"Метео","index":21,"n_rows":26,"n_cols":3,"rows_kept":26,"cut":false,"hidden":false,"merged":[]}
[1,"Характеристики атмосферы,  ","Ветровые волны, разгон ветра, его длина. "]
[2,"барометр, барограф, аненометр -  назначение","Величина волны в зависимости от времени воздействия ветра."]
[3,"Изобары, чтение метеокарт","Ветровые волны, разгон ветра, его длина. "]
[4,"Атмосферные фронты: тёплый, холодный, их характеристики.","Величина волны в зависимости от времени воздействия ветра."]
[5,"Типы облаков. ","Ветер постоянный, ровный, порывистый, шквальный."]
[6,"Шквал. Признаки приближения, ","Скорости и направления ветра в депрессии (циклоне) и антициклоне."]
{"$rows_left_out":21}
{"sheet":"Сигналы","index":22,"n_rows":39,"n_cols":3,"rows_kept":39,"cut":false,"hidden":false,"merged":[]}
[1,"AP","Прекращать. Гонка, которую прекращает гоночный или протестовый комитет, считается недействительной, но она может быть повторена."]
[2,"AP над H","Чисто позади и чисто впереди; связаны. Яхта находится чисто позади другой яхты, когда её корпус и оборудование в нормальном положении находятся позади траверза самой задней точки корпуса или оборудования другой яхты (в нормальном положении). Другая яхта находится чисто впереди. Яхты связаны, если ни одна из них не находится чисто позади другой. Они, однако, так же связаны, если яхта, находящаяся между ними, связана с обеими. Эти термины всегда применимы к яхтам, находящимся на одном галсе. Они не применяются к яхтам, находящимся на противоположных галсах, за исключением случаев, когда применяется правило 18  или когда обе яхты идут под углом более 90° к направлению истинного ветра."]
[3,"AP над A","Выходить на знак. Яхта выходит на знак, если она находится в такой позиции, что может, не изменяя галса, пройти знак с наветренной стороны и оставить его с предписанной стороны."]
[4,"N","Финиш. Яхта финиширует, когда любая часть её корпуса, экипажа или оборудования в их нормальном положении  пересекает финишную линию в направлении от последнего знака или впервые, или после выполнения наказания согласно правилу 44.2, либо после исправления по правилу 28.1 ошибки, сделанной у финишной линии."]
[5,"N над Н","Заинтересованная сторона. Любое лицо, которое может выиграть либо потерять вследствие решения протестового комитета или явно лично заинтересованное в таком решении."]
[6,"N над A","Сторониться. Яхта сторонится  другой яхты, если та может идти своим курсом без необходимости предпринимать избегающие действия, и когда яхты связаны на одном галсе, если подветренная яхта может изменить курс в любом направлении без немедленного касания наветренной яхты."]
{"$rows_left_out":34}
{"sheet":"Цифры","index":23,"n_rows":39,"n_cols":3,"rows_kept":39,"cut":false,"hidden":false,"merged":[]}
[1,1,"Прекращать. Гонка, которую прекращает гоночный или протестовый комитет, считается недействительной, но она может быть повторена."]
[2,2,"Чисто позади и чисто впереди; связаны. Яхта находится чисто позади другой яхты, когда её корпус и оборудование в нормальном положении находятся позади траверза самой задней точки корпуса или оборудования другой яхты (в нормальном положении). Другая яхта находится чисто впереди. Яхты связаны, если ни одна из них не находится чисто позади другой. Они, однако, так же связаны, если яхта, находящаяся между ними, связана с обеими. Эти термины всегда применимы к яхтам, находящимся на одном галсе. Они не применяются к яхтам, находящимся на противоположных галсах, за исключением случаев, когда применяется правило 18  или когда обе яхты идут под углом более 90° к направлению истинного ветра."]
[3,3,"Выходить на знак. Яхта выходит на знак, если она находится в такой позиции, что может, не изменяя галса, пройти знак с наветренной стороны и оставить его с предписанной стороны."]
[4,4,"Финиш. Яхта финиширует, когда любая часть её корпуса, экипажа или оборудования в их нормальном положении  пересекает финишную линию в направлении от последнего знака или впервые, или после выполнения наказания согласно правилу 44.2, либо после исправления по правилу 28.1 ошибки, сделанной у финишной линии."]
[5,5,"Заинтересованная сторона. Любое лицо, которое может выиграть либо потерять вследствие решения протестового комитета или явно лично заинтересованное в таком решении."]
[6,6,"Сторониться. Яхта сторонится  другой яхты, если та может идти своим курсом без необходимости предпринимать избегающие действия, и когда яхты связаны на одном галсе, если подветренная яхта может изменить курс в любом направлении без немедленного касания наветренной яхты."]
{"$rows_left_out":34}
{"sheet":"Правила","index":24,"n_rows":62,"n_cols":9,"rows_kept":62,"cut":false,"hidden":false,"merged":[]}
[1,"Прекращать. ","Прекращать. Гонка, которую прекращает гоночный или протестовый комитет, считается недействительной, но она может быть повторена.",1,"Дать опредление термину \"Гонка\" "]
[2,"Чисто позади и чисто впереди; связаны.","Чисто позади и чисто впереди; связаны. Яхта находится чисто позади другой яхты, когда её корпус и оборудование в нормальном положении находятся позади траверза самой задней точки корпуса или оборудования другой яхты (в нормальном положении). Другая яхта находится чисто впереди. Яхты связаны, если ни одна из них не находится чисто позади другой. Они, однако, так же связаны, если яхта, находящаяся между ними, связана с обеими. Эти термины всегда применимы к яхтам, находящимся на одном галсе. Они не применяются к яхтам, находящимся на противоположных галсах, за исключением случаев, когда применяется правило 18  или когда обе яхты идут под углом более 90° к направлению истинного ветра.",2,"Какая из яхт имеет право дороги ? (подветренный-наветренный)"]
[3,"Выходить на знак. ","Выходить на знак. Яхта выходит на знак, если она находится в такой позиции, что может, не изменяя галса, пройти знак с наветренной стороны и оставить его с предписанной стороны.",3,"Что такое знак?"]
[4,"Финиш. ","Финиш. Яхта финиширует, когда любая часть её корпуса, экипажа или оборудования в их нормальном положении  пересекает финишную линию в направлении от последнего знака или впервые, или после выполнения наказания согласно правилу 44.2, либо после исправления по правилу 28.1 ошибки, сделанной у финишной линии.",4,"Какая из яхт имеет право дороги ? правый-левый галс -галфвинд"]
[5,"Заинтересованная сторона. ","Заинтересованная сторона. Любое лицо, которое может выиграть либо потерять вследствие решения протестового комитета или явно лично заинтересованное в таком решении.",5,"С какого момента яхта считается стартовавшей?"]
[6,"Сторониться. ","Сторониться. Яхта сторонится  другой яхты, если та может идти своим курсом без необходимости предпринимать избегающие действия, и когда яхты связаны на одном галсе, если подветренная яхта может изменить курс в любом направлении без немедленного касания наветренной яхты.",6,"Кто нарушил правила? чисто впереди -чисто позади ",null,null,null,"чисто впереди -чисто позади "]
{"$rows_left_out":57}
{"sheet":"Право дороги","index":25,"n_rows":40,"n_cols":3,"rows_kept":40,"cut":false,"hidden":false,"merged":[]}
[1,"Право дороги Правило 10  НА ПРОТИВОПОЛОЖНЫХ ГАЛСАХ ","Прекращать. Гонка, которую прекращает гоночный или протестовый комитет, считается недействительной, но она может быть повторена."]
[2,"Право дороги Правило 11  НА ОДНОМ ГАЛСЕ. СВЯЗАННЫ","Чисто позади и чисто впереди; связаны. Яхта находится чисто позади другой яхты, когда её корпус и оборудование в нормальном положении находятся позади траверза самой задней точки корпуса или оборудования другой яхты (в нормальном положении). Другая яхта находится чисто впереди. Яхты связаны, если ни одна из них не находится чисто позади другой. Они, однако, так же связаны, если яхта, находящаяся между ними, связана с обеими. Эти термины всегда применимы к яхтам, находящимся на одном галсе. Они не применяются к яхтам, находящимся на противоположных галсах, за исключением случаев, когда применяется правило 18  или когда обе яхты идут под углом более 90° к направлению истинного ветра."]
[3,"Право дороги Правило 12  НА ОДНОМ ГАЛСЕ.  НЕ СВЯЗАННЫ","Выходить на знак. Яхта выходит на знак, если она находится в такой позиции, что может, не изменяя галса, пройти знак с наветренной стороны и оставить его с предписанной стороны."]
[4,"Право дороги Правило 14  ВО ВРЕМЯ ПОВОРОТА ОВЕРШТАГ","Финиш. Яхта финиширует, когда любая часть её корпуса, экипажа или оборудования в их нормальном положении  пересекает финишную линию в направлении от последнего знака или впервые, или после выполнения наказания согласно правилу 44.2, либо после исправления по правилу 28.1 ошибки, сделанной у финишной линии."]
[5," Правило 14 Избегания Контакта","Заинтересованная сторона. Любое лицо, которое может выиграть либо потерять вследствие решения протестового комитета или явно лично заинтересованное в таком решении."]
[6,"Правило 15 Получение Права дороги","Сторониться. Яхта сторонится  другой яхты, если та может идти своим курсом без необходимости предпринимать избегающие действия, и когда яхты связаны на одном галсе, если подветренная яхта может изменить курс в любом направлении без немедленного касания наветренной яхты."]
{"$rows_left_out":35}
{"sheet":"Практика","index":26,"n_rows":28,"n_cols":3,"rows_kept":28,"cut":false,"hidden":false,"merged":[]}
[1,"Подготовка яхты к выходу на воду."," Отход от причала при отжимном ветре с берега"]
[2,"Постановка Парусов в гавани при разных направлениях ветра","Подход и швартовка к бочке "]
[3,"Уборка Парусов в гавани при разных направлениях ветра.\nПорядок действий","Поворот оверштаг,"]
[4,"Основные правила управления яхтов на острых курсах"]
[5,"Движение Задним ходом под парусом","Маневрирование в ситуации «Человек за бортом»."]
[6,"Выполнение поворота фордевинд со спинакером на килевой яхтеПоворот, фордевинд.","Действие капитана и экипажа при различных аварийных ситуациях: обрыв вант, штага, ахтерштага, бакштагов; поломки рангоута, рулевого устройства; разрыва парусов; пробоины в корпусе."]
{"$rows_left_out":22}